wesnoth 1.5.6 does not build

Having trouble with the game? Report issues and get help here. Read this first!

Moderators: Forum Moderators, Developers

Forum rules
Before reporting issues in this section, you must read the following topic:
Post Reply
energyman76c
Posts: 199
Joined: May 26th, 2004, 9:38 pm

wesnoth 1.5.6 does not build

Post by energyman76c »

Hi,
when I try to compile wesnoth on gentoo/amd64 with gcc 4.3, boost 1.35, I get this error:

formula_tokenizer.o: In function `boost::basic_regex<char, boost::regex_traits<char, boost::cpp_regex_traits<char> > >::basic_regex(char const*, unsigned int)':
formula_tokenizer.cpp:(.text._ZN5boost11basic_regexIcNS_12regex_traitsIcNS_16cpp_regex_traitsIcEEEEEC1EPKcj[boost::basic_regex<char, boost::regex_traits<char, boost::cpp_regex_traits<char> > >::basic_regex(char const*, unsigned int)]+0x41): undefined reference to `boost::basic_regex<char, boost::regex_traits<char, boost::cpp_regex_traits<char> > >::do_assign(char const*, char const*, unsigned int)'
formula_tokenizer.o: In function `boost::re_detail::perl_matcher<__gnu_cxx::__normal_iterator<char const*, std::basic_string<char, std::char_traits<char>, std::allocator<char> > >, std::allocator<boost::sub_match<__gnu_cxx::__normal_iterator<char const*, std::basic_string<char, std::char_traits<char>, std::allocator<char> > > > >, boost::regex_traits<char, boost::cpp_regex_traits<char> > >::unwind_extra_block(bool)':
formula_tokenizer.cpp:(.text._ZN5boost9re_detail12perl_matcherIN9__gnu_cxx17__normal_iteratorIPKcSsEESaINS_9sub_matchIS6_EEENS_12regex_traitsIcNS_16cpp_regex_traitsIcEEEEE18unwind_extra_blockEb[boost::re_detail::perl_matcher<__gnu_cxx::__normal_iterator<char const*, std::basic_string<char, std::char_traits<char>, std::allocator<char> > >, std::allocator<boost::sub_match<__gnu_cxx::__normal_iterator<char const*, std::basic_string<char, std::char_traits<char>, std::allocator<char> > > > >, boost::regex_traits<char, boost::cpp_regex_traits<char> > >::unwind_extra_block(bool)]+0x2c): undefined reference to `boost::re_detail::put_mem_block(void*)'
formula_tokenizer.o: In function `void boost::re_detail::raise_error<boost::regex_traits_wrapper<boost::regex_traits<char, boost::cpp_regex_traits<char> > > >(boost::regex_traits_wrapper<boost::regex_traits<char, boost::cpp_regex_traits<char> > > const&, boost::regex_constants::error_type)':
formula_tokenizer.cpp:(.text._ZN5boost9re_detail11raise_errorINS_20regex_traits_wrapperINS_12regex_traitsIcNS_16cpp_regex_traitsIcEEEEEEEEvRKT_NS_15regex_constants10error_typeE[void boost::re_detail::raise_error<boost::regex_traits_wrapper<boost::regex_traits<char, boost::cpp_regex_traits<char> > > >(boost::regex_traits_wrapper<boost::regex_traits<char, boost::cpp_regex_traits<char> > > const&, boost::regex_constants::error_type)]+0x71): undefined reference to `boost::re_detail::get_default_error_string(boost::regex_constants::error_type)'
formula_tokenizer.cpp:(.text._ZN5boost9re_detail11raise_errorINS_20regex_traits_wrapperINS_12regex_traitsIcNS_16cpp_regex_traitsIcEEEEEEEEvRKT_NS_15regex_constants10error_typeE[void boost::re_detail::raise_error<boost::regex_traits_wrapper<boost::regex_traits<char, boost::cpp_regex_traits<char> > > >(boost::regex_traits_wrapper<boost::regex_traits<char, boost::cpp_regex_traits<char> > > const&, boost::regex_constants::error_type)]+0xab): undefined reference to `boost::re_detail::raise_runtime_error(std::runtime_error const&)'
formula_tokenizer.cpp:(.text._ZN5boost9re_detail11raise_errorINS_20regex_traits_wrapperINS_12regex_traitsIcNS_16cpp_regex_traitsIcEEEEEEEEvRKT_NS_15regex_constants10error_typeE[void boost::re_detail::raise_error<boost::regex_traits_wrapper<boost::regex_traits<char, boost::cpp_regex_traits<char> > > >(boost::regex_traits_wrapper<boost::regex_traits<char, boost::cpp_regex_traits<char> > > const&, boost::regex_constants::error_type)]+0xdb): undefined reference to `boost::re_detail::get_default_error_string(boost::regex_constants::error_type)'
formula_tokenizer.o: In function `boost::re_detail::perl_matcher<__gnu_cxx::__normal_iterator<char const*, std::basic_string<char, std::char_traits<char>, std::allocator<char> > >, std::allocator<boost::sub_match<__gnu_cxx::__normal_iterator<char const*, std::basic_string<char, std::char_traits<char>, std::allocator<char> > > > >, boost::regex_traits<char, boost::cpp_regex_traits<char> > >::extend_stack()':
formula_tokenizer.cpp:(.text._ZN5boost9re_detail12perl_matcherIN9__gnu_cxx17__normal_iteratorIPKcSsEESaINS_9sub_matchIS6_EEENS_12regex_traitsIcNS_16cpp_regex_traitsIcEEEEE12extend_stackEv[boost::re_detail::perl_matcher<__gnu_cxx::__normal_iterator<char const*, std::basic_string<char, std::char_traits<char>, std::allocator<char> > >, std::allocator<boost::sub_match<__gnu_cxx::__normal_iterator<char const*, std::basic_string<char, std::char_traits<char>, std::allocator<char> > > > >, boost::regex_traits<char, boost::cpp_regex_traits<char> > >::extend_stack()]+0x18): undefined reference to `boost::re_detail::get_mem_block()'
formula_tokenizer.o: In function `boost::re_detail::perl_matcher<__gnu_cxx::__normal_iterator<char const*, std::basic_string<char, std::char_traits<char>, std::allocator<char> > >, std::allocator<boost::sub_match<__gnu_cxx::__normal_iterator<char const*, std::basic_string<char, std::char_traits<char>, std::allocator<char> > > > >, boost::regex_traits<char, boost::cpp_regex_traits<char> > >::find_imp()':
formula_tokenizer.cpp:(.text._ZN5boost9re_detail12perl_matcherIN9__gnu_cxx17__normal_iteratorIPKcSsEESaINS_9sub_matchIS6_EEENS_12regex_traitsIcNS_16cpp_regex_traitsIcEEEEE8find_impEv[boost::re_detail::perl_matcher<__gnu_cxx::__normal_iterator<char const*, std::basic_string<char, std::char_traits<char>, std::allocator<char> > >, std::allocator<boost::sub_match<__gnu_cxx::__normal_iterator<char const*, std::basic_string<char, std::char_traits<char>, std::allocator<char> > > > >, boost::regex_traits<char, boost::cpp_regex_traits<char> > >::find_imp()]+0xc): undefined reference to `boost::re_detail::get_mem_block()'
formula_tokenizer.cpp:(.text._ZN5boost9re_detail12perl_matcherIN9__gnu_cxx17__normal_iteratorIPKcSsEESaINS_9sub_matchIS6_EEENS_12regex_traitsIcNS_16cpp_regex_traitsIcEEEEE8find_impEv[boost::re_detail::perl_matcher<__gnu_cxx::__normal_iterator<char const*, std::basic_string<char, std::char_traits<char>, std::allocator<char> > >, std::allocator<boost::sub_match<__gnu_cxx::__normal_iterator<char const*, std::basic_string<char, std::char_traits<char>, std::allocator<char> > > > >, boost::regex_traits<char, boost::cpp_regex_traits<char> > >::find_imp()]+0x272): undefined reference to `boost::re_detail::verify_options(unsigned int, boost::regex_constants::_match_flags)'
formula_tokenizer.cpp:(.text._ZN5boost9re_detail12perl_matcherIN9__gnu_cxx17__normal_iteratorIPKcSsEESaINS_9sub_matchIS6_EEENS_12regex_traitsIcNS_16cpp_regex_traitsIcEEEEE8find_impEv[boost::re_detail::perl_matcher<__gnu_cxx::__normal_iterator<char const*, std::basic_string<char, std::char_traits<char>, std::allocator<char> > >, std::allocator<boost::sub_match<__gnu_cxx::__normal_iterator<char const*, std::basic_string<char, std::char_traits<char>, std::allocator<char> > > > >, boost::regex_traits<char, boost::cpp_regex_traits<char> > >::find_imp()]+0x2ba): undefined reference to `boost::re_detail::put_mem_block(void*)'
formula_tokenizer.cpp:(.text._ZN5boost9re_detail12perl_matcherIN9__gnu_cxx17__normal_iteratorIPKcSsEESaINS_9sub_matchIS6_EEENS_12regex_traitsIcNS_16cpp_regex_traitsIcEEEEE8find_impEv[boost::re_detail::perl_matcher<__gnu_cxx::__normal_iterator<char const*, std::basic_string<char, std::char_traits<char>, std::allocator<char> > >, std::allocator<boost::sub_match<__gnu_cxx::__normal_iterator<char const*, std::basic_string<char, std::char_traits<char>, std::allocator<char> > > > >, boost::regex_traits<char, boost::cpp_regex_traits<char> > >::find_imp()]+0x600): undefined reference to `boost::re_detail::put_mem_block(void*)'
formula_tokenizer.o: In function `bool boost::regex_search<__gnu_cxx::__normal_iterator<char const*, std::basic_string<char, std::char_traits<char>, std::allocator<char> > >, std::allocator<boost::sub_match<__gnu_cxx::__normal_iterator<char const*, std::basic_string<char, std::char_traits<char>, std::allocator<char> > > > >, char, boost::regex_traits<char, boost::cpp_regex_traits<char> > >(__gnu_cxx::__normal_iterator<char const*, std::basic_string<char, std::char_traits<char>, std::allocator<char> > >, __gnu_cxx::__normal_iterator<char const*, std::basic_string<char, std::char_traits<char>, std::allocator<char> > >, boost::match_results<__gnu_cxx::__normal_iterator<char const*, std::basic_string<char, std::char_traits<char>, std::allocator<char> > >, std::allocator<boost::sub_match<__gnu_cxx::__normal_iterator<char const*, std::basic_string<char, std::char_traits<char>, std::allocator<char> > > > > >&, boost::basic_regex<char, boost::regex_traits<char, boost::cpp_regex_traits<char> > > const&, boost::regex_constants::_match_flags, __gnu_cxx::__normal_iterator<char const*, std::basic_string<char, std::char_traits<char>, std::allocator<char> > >)':
formula_tokenizer.cpp:(.text._ZN5boost12regex_searchIN9__gnu_cxx17__normal_iteratorIPKcSsEESaINS_9sub_matchIS5_EEEcNS_12regex_traitsIcNS_16cpp_regex_traitsIcEEEEEEbT_SD_RNS_13match_resultsISD_T0_EERKNS_11basic_regexIT1_T2_EENS_15regex_constants12_match_flagsESD_[bool boost::regex_search<__gnu_cxx::__normal_iterator<char const*, std::basic_string<char, std::char_traits<char>, std::allocator<char> > >, std::allocator<boost::sub_match<__gnu_cxx::__normal_iterator<char const*, std::basic_string<char, std::char_traits<char>, std::allocator<char> > > > >, char, boost::regex_traits<char, boost::cpp_regex_traits<char> > >(__gnu_cxx::__normal_iterator<char const*, std::basic_string<char, std::char_traits<char>, std::allocator<char> > >, __gnu_cxx::__normal_iterator<char const*, std::basic_string<char, std::char_traits<char>, std::allocator<char> > >, boost::match_results<__gnu_cxx::__normal_iterator<char const*, std::basic_string<char, std::char_traits<char>, std::allocator<char> > >, std::allocator<boost::sub_match<__gnu_cxx::__normal_iterator<char const*, std::basic_string<char, std::char_traits<char>, std::allocator<char> > > > > >&, boost::basic_regex<char, boost::regex_traits<char, boost::cpp_regex_traits<char> > > const&, boost::regex_constants::_match_flags, __gnu_cxx::__normal_iterator<char const*, std::basic_string<char, std::char_traits<char>, std::allocator<char> > >)]+0x12a): undefined reference to `boost::re_detail::perl_matcher<__gnu_cxx::__normal_iterator<char const*, std::basic_string<char, std::char_traits<char>, std::allocator<char> > >, std::allocator<boost::sub_match<__gnu_cxx::__normal_iterator<char const*, std::basic_string<char, std::char_traits<char>, std::allocator<char> > > > >, boost::regex_traits<char, boost::cpp_regex_traits<char> > >::construct_init(boost::basic_regex<char, boost::regex_traits<char, boost::cpp_regex_traits<char> > > const&, boost::regex_constants::_match_flags)'
formula_tokenizer.o: In function `boost::re_detail::perl_matcher<__gnu_cxx::__normal_iterator<char const*, std::basic_string<char, std::char_traits<char>, std::allocator<char> > >, std::allocator<boost::sub_match<__gnu_cxx::__normal_iterator<char const*, std::basic_string<char, std::char_traits<char>, std::allocator<char> > > > >, boost::regex_traits<char, boost::cpp_regex_traits<char> > >::match_match()':
formula_tokenizer.cpp:(.text._ZN5boost9re_detail12perl_matcherIN9__gnu_cxx17__normal_iteratorIPKcSsEESaINS_9sub_matchIS6_EEENS_12regex_traitsIcNS_16cpp_regex_traitsIcEEEEE11match_matchEv[boost::re_detail::perl_matcher<__gnu_cxx::__normal_iterator<char const*, std::basic_string<char, std::char_traits<char>, std::allocator<char> > >, std::allocator<boost::sub_match<__gnu_cxx::__normal_iterator<char const*, std::basic_string<char, std::char_traits<char>, std::allocator<char> > > > >, boost::regex_traits<char, boost::cpp_regex_traits<char> > >::match_match()]+0x111): undefined reference to `boost::match_results<__gnu_cxx::__normal_iterator<char const*, std::basic_string<char, std::char_traits<char>, std::allocator<char> > >, std::allocator<boost::sub_match<__gnu_cxx::__normal_iterator<char const*, std::basic_string<char, std::char_traits<char>, std::allocator<char> > > > > >::maybe_assign(boost::match_results<__gnu_cxx::__normal_iterator<char const*, std::basic_string<char, std::char_traits<char>, std::allocator<char> > >, std::allocator<boost::sub_match<__gnu_cxx::__normal_iterator<char const*, std::basic_string<char, std::char_traits<char>, std::allocator<char> > > > > > const&)'
formula_tokenizer.o: In function `__gnu_cxx::__normal_iterator<char const*, std::basic_string<char, std::char_traits<char>, std::allocator<char> > > boost::re_detail::re_is_set_member<__gnu_cxx::__normal_iterator<char const*, std::basic_string<char, std::char_traits<char>, std::allocator<char> > >, char, boost::regex_traits<char, boost::cpp_regex_traits<char> >, unsigned int>(__gnu_cxx::__normal_iterator<char const*, std::basic_string<char, std::char_traits<char>, std::allocator<char> >>, __gnu_cxx::__normal_iterator<char const*, std::basic_string<char, std::char_traits<char>, std::allocator<char> > >, boost::re_detail::re_set_long<unsigned int> const*, boost::re_detail::regex_data<char, boost::regex_traits<char, boost::cpp_regex_traits<char> > > const&, bool)':
formula_tokenizer.cpp:(.text._ZN5boost9re_detail16re_is_set_memberIN9__gnu_cxx17__normal_iteratorIPKcSsEEcNS_12regex_traitsIcNS_16cpp_regex_traitsIcEEEEjEET_SB_SB_PKNS0_11re_set_longIT2_EERKNS0_10regex_dataIT0_T1_EEb[__gnu_cxx::__normal_iterator<char const*, std::basic_string<char, std::char_traits<char>, std::allocator<char> > > boost::re_detail::re_is_set_member<__gnu_cxx::__normal_iterator<char const*, std::basic_string<char, std::char_traits<char>, std::allocator<char> > >, char, boost::regex_traits<char, boost::cpp_regex_traits<char> >, unsigned int>(__gnu_cxx::__normal_iterator<char const*, std::basic_string<char, std::char_traits<char>, std::allocator<char> > >, __gnu_cxx::__normal_iterator<char const*, std::basic_string<char, std::char_traits<char>, std::allocator<char> > >, boost::re_detail::re_set_long<unsigned int> const*, boost::re_detail::regex_data<char, boost::regex_traits<char, boost::cpp_regex_traits<char> > > const&, bool)]+0x358): undefined referenceto `boost::re_detail::cpp_regex_traits_implementation<char>::transform_primary(char const*, char const*) const'
formula_tokenizer.cpp:(.text._ZN5boost9re_detail16re_is_set_memberIN9__gnu_cxx17__normal_iteratorIPKcSsEEcNS_12regex_traitsIcNS_16cpp_regex_traitsIcEEEEjEET_SB_SB_PKNS0_11re_set_longIT2_EERKNS0_10regex_dataIT0_T1_EEb[__gnu_cxx::__normal_iterator<char const*, std::basic_string<char, std::char_traits<char>, std::allocator<char> > > boost::re_detail::re_is_set_member<__gnu_cxx::__normal_iterator<char const*, std::basic_string<char, std::char_traits<char>, std::allocator<char> > >, char, boost::regex_traits<char, boost::cpp_regex_traits<char> >, unsigned int>(__gnu_cxx::__normal_iterator<char const*, std::basic_string<char, std::char_traits<char>, std::allocator<char> > >, __gnu_cxx::__normal_iterator<char const*, std::basic_string<char, std::char_traits<char>, std::allocator<char> > >, boost::re_detail::re_set_long<unsigned int> const*, boost::re_detail::regex_data<char, boost::regex_traits<char, boost::cpp_regex_traits<char> > > const&, bool)]+0x5b5): undefined referenceto `boost::re_detail::cpp_regex_traits_implementation<char>::transform(char const*, char const*) const'
collect2: ld returned 1 exit status
make[2]: *** [wesnoth] Error 1
make[2]: Leaving directory `/var/tmp/wesnoth-1.5.6/src'
make[1]: *** [all-recursive] Error 1
make[1]: Leaving directory `/var/tmp/wesnoth-1.5.6'
make: *** [all] Error 2

User avatar
ivanovic
Lord of Translations
Posts: 1147
Joined: September 28th, 2004, 10:10 pm
Location: Germany

Re: wesnoth 1.5.6 does not build

Post by ivanovic »

Strange one because the system I tested the tarball on before uploading it is Gentoo unstable amd64 with those versions of gcc and boost. Somehow your error sounds like something has gone boom with your version of boost regexp. Though this is a *very* rough guess.

energyman76c
Posts: 199
Joined: May 26th, 2004, 9:38 pm

Re: wesnoth 1.5.6 does not build

Post by energyman76c »

I will rebuilt boost tonight, maybe it is some dep-update related breakage.

energyman76c
Posts: 199
Joined: May 26th, 2004, 9:38 pm

Re: wesnoth 1.5.6 does not build

Post by energyman76c »

it was boost. After a rebuilt everything went fine.

User avatar
ivanovic
Lord of Translations
Posts: 1147
Joined: September 28th, 2004, 10:10 pm
Location: Germany

Re: wesnoth 1.5.6 does not build

Post by ivanovic »

Great to hear that your problem is solved.

Post Reply